Installation error on ubuntu 16

Post in this forum any question related to the installation on any of the supported platforms (Linux, Mac OS X, Windows)
Post Reply
Posts: 8
Joined: Tue Apr 26, 2022 3:45 am

Installation error on ubuntu 16

Post by Lessandro_Sadala »

I'm trying to install version 2.10.1 on my ubuntu, however when I get to the >make step I get the following error:

Makefile.Release:795: recipe for target 'release/AbstractStream.o' failed
make[2]: *** [release/AbstractStream.o] Error 1
make[2]: Leaving directory '/home/lessandro/Downloads/geopsypack-55items-src-2.10.1/QGpCoreTools'
Makefile:38: recipe for target 'release' failed
make[1]: *** [release] Error 2
make[1]: Leaving directory '/home/lessandro/Downloads/geopsypack-55items-src-2.10.1/QGpCoreTools'
Makefile:118: recipe for target 'sub-QGpCoreTools-make_first-ordered' failed
make: *** [sub-QGpCoreTools-make_first-ordered] Error 2

Could anyone help me to solve it?
Post Reply